{"text_format":"1","workbook":"xlsx","n_sheets":4,"sheets":["Feed(WS)","NonQM Program(JAM)","Cover Page","Sheet1"],"not_rendered":{"charts":0,"images":4,"macros":1,"external_links":0,"defined_names":1119,"comments":0,"pivot_tables":0},"unopened":[],"bounds":{"document_bytes":16777216,"sheet_cells":100000,"rows_first":2000,"rows_last":500,"rows_between":2000,"halvings":0,"cell_chars":16384,"cell_head_chars":4096},"cells_cut":0,"cells_raw":0,"read":"whole","date_system":"1900"}

{"sheet":"Feed(WS)","index":0,"n_rows":150,"n_cols":29,"rows_kept":150,"cut":false,"hidden":true,"merged":[[137,1,137,2],[138,1,138,2],[139,1,139,2],[142,1,142,2],[135,1,135,2],[136,1,136,2],[140,1,140,2],[141,1,141,2],[133,8,133,9],[79,8,79,11],[134,8,134,9],[128,1,128,3],[129,1,129,2],[130,1,130,2],[131,1,131,2],[132,1,132,2],[133,1,133,2],[79,1,79,4],[134,1,134,2]]}
["FICO","LTV","Grades","Doc Type","Additional Adjs","DTI","Loan Amount","Prepayment Penalties","Escrow Waiver","Purpose","Property Type","Occupancy","Term","Lock Period","Comp Type","Citizenships","Foreign National","Buydown","Subordinate Financing","State",null,"NOO & 2nd Home >75% LTV",null,{"$f":"IF(AND(OR('NonQM Program(JAM)'!U10=B9:B11),OR('NonQM Program(JAM)'!U19=L4:L6)),V4,V3)","v":"Not Applicable"},"Full/Alt 0.250, DSCR 0.500",{"$f":"IF(AND(OR('NonQM Program(JAM)'!U13=D3:D4),OR('NonQM Program(JAM)'!U12=C4:C7)),0.25,IF(AND(OR('NonQM Program(JAM)'!U12=C8:C10),OR('NonQM Program(JAM)'!U11=A3:A9),OR('NonQM Program(JAM)'!U23=H7:H9),OR('NonQM Program(JAM)'!U13=D5),OR('NonQM Program(JAM)'!U20=K3:K5,'NonQM Program(JAM)'!U20=K7:K9)),0.5,0))","v":0},"Special "]
["Choose a Selection","Choose a Selection","Choose a Selection","Choose a Selection","Choose a Selection","Choose a Selection","Choose a Selection","Choose a Selection","Choose a Selection","Choose a Selection","Choose a Selection","Choose a Selection","Choose a Selection","Choose a Selection","Choose a Selection","Choose a Selection","Choose a Selection","Choose a Selection","Choose a Selection","Choose a Selection",null,"Full/Alt NOO & 2nd Home ≤75% LTV",null,{"$f":"IF(AND(OR('NonQM Program(JAM)'!U10=B3:B8),OR('NonQM Program(JAM)'!U12=C3:C7),OR('NonQM Program(JAM)'!U19=L4:L6)),V4,V3)","v":"Not Applicable"}]
["780+","<=50","Select Standard","Full Doc","None in this Dropdown","DTI ≤45% - All Doc Types","<$150,000","No PPP *See PPP Section*","Escrow Not Waived","Purchase","SFR","Primary","15YR Fixed","15 Day","Borrower Paid","US Citizen","Not Applicable1","No","No","All Other States",null,"Not Applicable",null,null,"Cash-Out/Debt Consol. FICO < 680",{"$f":"IF(AND(OR('NonQM Program(JAM)'!U11=A9:A12),OR('NonQM Program(JAM)'!U18=J5:J8)),VLOOKUP($Y$3,'NonQM Program(JAM)'!$G$26:$I$66,3,FALSE),0)","v":0},"Cash-Out/Debt Consol. FICO < 680"]
["760-779","50.01-55","A+","Alt Doc","Asset Utilization","DTI >45% - All Doc Types","$150,000-$1,000,000","6 Months PPP","Escrow Waived","Refinances","2 Units","Second Home","30YR Fixed","30 Day",null,"Permanent Resident","Not Applicable2","2:1 Buydown","Yes","Alaska",null,"Yes",null,null,"Not Applicable",null," "]
["740-759","55.01-60","A","DSCR","1099 Only","DTI ≥50% - All Doc Types",">$1,000,000","12 Months PPP",null,"Debt Consol. ≤ 70% LTV","3-4 Units","Full Doc - Non-Owner","30YR IO Fixed","45 Day",null,"Non Perm Resident","Not Applicable3","1:0 Buydown",null,"California",null,null,null,null,"Yes",null,null,null," "]
["720-739","60.01-65","B",null,"VOE Only","No DTI Program",">$1,500,000","24 Months PPP",null,"Debt Consol. >70% LTV","DSCR 5-8 Units","Non-Owner (Alt Doc/DSCR)","40YR IO Fixed","60 Day",null,"ITIN",null,null,null,"Maryland",null,null,null,null,null,null,null,null," "]
["700-719","65.01-70","C",null,"P&L w/ Bk Stmt",null,">$2,000,000","36 Months PPP",null,"Cash-Out ≤ 70% LTV","Condo",null,"40YR Fixed","75 Day",null,"Foreign Nat' With Fico",null,null,null,"Minnesota",null,null,null,"green is logic",null,null,null,null," "]
["680-699","70.01-75","Select - DSCR",null,"DSCR STR",null,">$2,500,000","48 Months PPP",null,"Cash-Out >70% LTV","NW Condo",null,"5/6 30YR ARM",null,null,null,null,null,null,"New Mexico",null,null,null,"z1 cell has 2 specials formulas",null,null,null,null," "]
["660-679","75.01-80","DSCR (≥1.20)",null,null,null,">$3,000,000","60 Months PPP",null,null,"PUD",null,"5/6 30YR IO ARM",null,null,null,null,null,null,"New Hampshire",null,null,null,null,null,null,null,null," "]
["640-659","80.01-85","DSCR (≥1.00)",null,null,null,">$3,500,000",null,null,null,null,null,"5/6 40YR ARM",null,null,null,null,null,null,"Delaware",null,null,null,null,null,null,null,null," "]
["620-639","85.01-90","No Ratio (0.75-0.99)",null,null,null,">$4,000,000",null,null,null,null,null,"7/6 30YR ARM",null,null,null,null,null,null,"Georgia"]
["600-619",null,null,null,null,null,null,null,null,null,null,null,"7/6 30YR IO ARM",null,null,null,null,null,null,"Illinois",null,null,null,null,null,null,null,null," "]
[null,null,null,null,null,null,null,"Title Vesting",null,null,null,null,"7/6 40YR ARM",null,null,null,null,null,null,"Kansas",null,null,null,null,null,null,null,null," "]
[null,null,null,null,null,null,null,null,null,null,null,null,null,null,null,null,null,null,null,"New Jersey"]
[null,null,null,null,null,null,null,"NJ Title Vested In LLC",null,null,null,null,null,null,null,null,null,null,null,"North Carolina"]
[" 'NonQM Program(JAM)'!",null,null,null,null,null,null,"NJ Title Vested In Corp"]
["Feed(WS)'!"]
[]
[]
[]
[]
[null,null,null,null,null,null,null,null,null,null,null,null,null,null,null,null,null,null,null,null,null,null,null,null,null,null,null,null," "]
[null,null,null,null,null,null,null,null,null,null,null,null,null,null,null,null,null,null,null,null,null,null,null,null,null,null,null,null," "]
[null,null,null,null,null,null,null,null,null,null,null,null,null,null,null,null,null,null,null,null,null,null,null,null,null,null,null,null," "]
[null,null,null,null,null,null,null,null,null,null,null,null,null,null,null,null,null,null,null,null,null,null,null,null,null,null,null,null," "]
[null,null,null,null,null,null,null,null,null,null,null,null,null,null,null,null,null,null,null,null,null,null,null,null,null,null,null,null," "]
[null,null,null,null,null,null,null,null,null,null,null,null,null,null,null,null,null,null,null,null,null,null,null,null,null,null,null,null," "]
[null,null,null,null,null,null,null,null,null,null,null,null,null,null,null,null,null,null,null,null,null,null,null,null,null,null,null,null," "]
["Pop Ups",null,null,null,null,null,null,null,null,null,null,null,null,null,null,null,null,null,null,null,null,null,null,null,null,null,null,null," "]
["No Ratio above 60% warning",{"$f":"IF(AND(OR('NonQM Program(JAM)'!U10='Feed(WS)'!B6:B11),'NonQM Program(JAM)'!U12=\"No Ratio (0.75-0.99)\"),TRUE,FALSE)","v":false},null,null,null,null,null,null,null,null,null,null,null,null,null,null,null,null,null,null,null,null,null,null,null,null,null,null," "]
{"$rows_left_out":121}
{"sheet":"NonQM Program(JAM)","index":1,"n_rows":75,"n_cols":27,"rows_kept":75,"cut":false,"hidden":false,"merged":[[33,6,33,7],[39,10,39,11],[41,10,41,12],[46,10,46,12],[50,12,51,12],[52,11,52,12],[53,10,53,11],[55,10,68,12],[57,14,57,15],[58,14,58,15],[53,14,53,16],[40,14,40,15],[18,6,18,7],[18,18,18,19],[18,22,18,25],[24,6,24,8],[24,10,24,12],[24,14,24,16],[24,18,24,19],[24,22,24,25],[25,10,25,11],[25,14,25,15],[25,18,25,19],[25,22,25,25],[22,18,22,19],[0,7,1,10],[0,14,1,16],[2,7,2,10],[2,14,2,16],[3,7,3,10],[3,13,3,16],[9,6,9,7],[9,18,9,19],[9,23,9,25],[8,6,8,16],[8,18,8,19],[4,12,4,13],[4,14,4,16],[5,0,6,16],[5,18,6,21],[5,22,6,25],[7,18,7,19],[7,21,7,24],[8,0,8,3],[9,26,9,28],[10,6,10,7],[10,18,10,19],[10,23,10,25],[10,26,10,28],[7,26,7,28],[8,23,8,25],[8,26,8,28],[13,6,13,7],[13,18,13,19],[13,22,13,25],[13,26,13,27],[14,26,14,28],[11,6,11,7],[11,18,11,19],[11,26,11,28],[12,6,12,7],[12,18,12,19],[12,22,12,25],[12,26,12,28],[17,6,17,7],[17,18,17,19],[17,22,17,25],[17,26,17,28],[15,6,15,7],[15,18,15,19],[15,26,15,28],[16,6,16,7],[16,18,16,19],[16,22,16,25],[16,26,16,28],[14,6,14,7],[14,18,14,19],[14,22,14,25],[20,26,20,28],[21,18,21,19],[21,22,21,25],[21,26,21,28],[23,18,23,19],[23,22,23,25],[23,26,23,28],[19,6,19,7],[19,18,19,19],[19,22,19,25],[20,6,20,7],[20,18,20,19],[20,22,20,25],[26,6,26,7],[26,10,26,11],[26,14,26,15],[26,18,26,19],[26,22,26,25],[27,6,27,7],[27,10,27,11],[27,14,27,15],[28,18,28,19],[28,22,28,25],[27,18,27,19],[28,6,28,7],[28,10,28,11],[28,14,28,15],[29,18,29,19],[29,22,29,25],[29,6,29,7],[29,10,29,11],[29,14,29,15],[30,18,30,19],[30,22,31,25],[32,10,32,11],[32,14,32,15],[31,6,31,7],[32,6,32,7],[33,18,33,20],[33,10,33,11],[33,14,33,15],[34,18,34,20],[29,26,29,28],[30,6,30,7],[30,10,30,11],[30,14,30,15],[31,18,31,20],[31,10,31,11],[31,14,31,15],[32,18,32,20],[32,22,32,25],[31,26,44,28],[34,22,34,25],[34,14,34,15],[35,18,35,20],[35,22,35,25],[35,10,35,12],[35,14,35,15],[36,18,41,21],[36,22,36,25],[36,10,36,11],[37,22,37,25],[71,14,76,16],[45,21,45,24],[45,10,45,12],[45,14,45,15],[41,22,41,25],[41,14,41,15],[42,18,42,20],[37,10,37,11],[37,14,37,16],[38,22,38,25],[38,10,38,11],[38,14,38,15],[39,14,39,15],[42,14,42,15],[55,0,55,4],[56,0,70,4],[56,14,56,15],[69,6,69,8],[43,18,43,20],[43,14,43,15],[44,18,44,20],[44,14,44,15],[45,18,45,20],[54,14,54,15],[55,14,55,16],[59,14,59,15],[61,14,61,16],[62,14,68,16],[70,14,70,16]]}
[null,null,null,null,null,null,null,null,null,null,null,null,null,null,"Wholesale Ratesheet"]
[]
[null,null,null,null,null,null,null,null,null,null,null,null,null,null,"30 Day Lock Period"]
[null,null,null,null,null,null,null,null,null,null,null,null,null,"Borrower Paid Compensation*"]
[null,null,null,null,null,null,null,null,null,null,null,null,"Effective Date:",null,"2024-10-10"]
["Non QM Program Pricing",null,null,null,null,null,null,null,null,null,null,null,null,null,null,null,null,null,"Calculator",null,null,null,"Calculator does not verify eligibility.\nPlease use in conjunction with product matrix."]
[]
[null,null,null,null,null,null,null,null,null,null,null,null,null,null,null,null,null,null,null,null,"Inputs","Wholesale Ratesheet",null,null,null,{"$f":"O5","v":"2024-10-10"},"Full Doc Column Includes"]
["Base Rate / Base Price",null,null,null,null,null,"FICO/LTV Price Adjustments",null,null,null,null,null,null,null,null,null,null,null," Interest Rate →",null,"Choose a Selection",null,null,null,null,null,"Tax Returns"]
["Rate","Full Doc","Alt Doc","DSCR",null,null,null,null,"<=50","50.01-60","60.01-65","65.01-70","70.01-75","75.01-80","80.01-85","85.01-90","90.01-95",null,"LTV Range",null,"Choose a Selection",null,null,null,null,null,"1099 Only"]
[5.875,{"$error":"#N/A"},{"$error":"#N/A"},{"$error":"#N/A"},null,null,"780+",null,0.75,0.625,0.5,0.25,-0.125,-0.375,-2.5,-4.75,{"$error":"#N/A"},null,"FICO Range",null,"Choose a Selection",{"$f":"IF(OR(U10='Feed(WS)'!B4:B5),INDEX(J11:J21,MATCH(U11,G11:G21,0)),(INDEX(I11:Q21,MATCH(U11,G11:G21,0),MATCH(U10,I10:Q10))))","v":{"$error":"#N/A"}},null,null,null,null,"Asset Utilization Only"]
[5.9989999999999997,{"$error":"#N/A"},{"$error":"#N/A"},{"$error":"#N/A"},null,null,"760-779",null,0.625,0.5,0.25,0.125,-0.375,-0.5,-2.75,-5,{"$error":"#N/A"},null,"Grade",null,"Choose a Selection",{"$f":"IF(U12=\"Choose a Selection\",0,(INDEX(M26:M34,MATCH(U12,K26:K34,0))))","v":0},null,null,null,null,"Asset Utilization W/ Full Doc"]
[6.125,98,98,{"$error":"#N/A"},null,null,"740-759",null,0.5,0.25,0.125,-0.125,-0.5,-0.75,-3,-5.25,{"$error":"#N/A"},null,"Doc Type",null,"Choose a Selection",null,{"$f":"'Feed(WS)'!B66","v":0},null,null,null,"VOE"]
[6.25,98.5,98.5,98.75,null,null,"720-739",null,0.25,0.125,-0.125,-0.25,-0.75,-1,-3.5,-5.75,{"$error":"#N/A"},null,"Additional Adjs",null,"Choose a Selection",{"$f":"IF(AND(OR(U10='Feed(WS)'!B10:B11),OR(U14='Feed(WS)'!E4,U14='Feed(WS)'!E6)),NA(),IF((AND((IF(U10=\"85.01-90\",1,0))=1,(IF(U13=\"DSCR\",1,0))=1))=TRUE,NA(),(IF(OR((AND(OR(U11='Feed(WS)'!$A$7:$A$12),IF(U10=\"80.01-85\",1,0),IF(U13=\"DSCR\",1,0)))=TRUE,(AND(OR(U11='Feed(WS)'!A6:A12),IF(U10=\"80.01-85\",1,0),IF(U13=\"DSCR\",1,0),OR(U18='Feed(WS)'!J5:J9))=TRUE)),NA(),IF(U14=\"Choose a Selection\",0,(IF(U14=\"None in this Dropdown\",0,IF(U14=\"12 Month Full / Alt Doc\",0,INDEX(I$27:I$65,MATCH(U14,G$27:G$65,0))))))))))","v":0}]
[6.375,98.75,98.75,99.25,null,null,"700-719",null,-0.125,-0.375,-0.5,-0.75,-1.25,-1.5,-4.25,-6.5,{"$error":"#N/A"},null,"Citizenships",null,"Choose a Selection",{"$f":"(IF(U15=\"US Citizen\",0,(IF(U15=\"Permanent Resident\",0,(IF(U15=\"Non Perm Resident\",0,(IF(U15=\"ITIN\",VLOOKUP(U15,G27:I65,3,0),(IF(U15=\"Foreign Nat' No Fico\",INDEX(I13:Q21,MATCH(U15,G13:G21,0),MATCH(U10,I10:Q10)),IF(U15=\"Foreign Nat' With Fico\",IF(U15=\"Foreign Nat' With Fico\",INDEX(G27:I65,(MATCH(U15,G27:G65,0)),3)),NA())))))))))))","v":{"$error":"#N/A"}},null,null,null,null,"Alt Doc Column Includes"]
[6.4989999999999997,99.25,99.25,99.75,null,null,"680-699",null,-0.375,-0.5,-0.75,-1.25,-1.75,-2.5,-5.25,{"$error":"#N/A"},{"$error":"#N/A"},null,"DTI",null,"Choose a Selection",{"$f":"IF(U16=\"DTI ≥50% - All Doc Types\",IF((AND(IF(U16=\"DTI ≥50% - All Doc Types\",1,0),(IF(U13=\"Full Doc\",1,0)),(IF(U18=\"Purchase\",1,0)),(IF(U19=\"Primary\",1,0)),(IF(OR(U17='Feed(WS)'!G3:G5),1,0)),(IF(OR(U10='Feed(WS)'!B3:B9),1,0)),(IF(OR(U11='Feed(WS)'!A3:A9),1,0)),(IF(U12=\"A+\",1,0)))),IF(U16=\"Choose a Selection\",0,(IF(U16=\"DTI  ≤45% - All Doc Types\",0,IF(U16=\"No DTI Program\",0,INDEX(I$27:I$65,MATCH(U16,G$27:G$65,0)))))),NA()), IF((AND(IF(U16=\"DTI ≥50% - All Doc Types\",1,0),(IF(U18<>\"Purchase\",1,0)))),NA(),IF(U16=\"Choose a Selection\",0,(IF(U16=\"DTI ≤45% - All Doc Types\",0,IF(U16=\"No DTI Program\",0,INDEX(I$27:I$65,MATCH(U16,G$27:G$65,0))))))))","v":0},null,{"$f":"W39","v":0},null,null,"12 Bank Statements"]
[6.625,99.5,99.5,100,null,null,"660-679",null,-0.75,-1,-1.5,-2,-2.75,-3.5,{"$error":"#N/A"},{"$error":"#N/A"},{"$error":"#N/A"},null,"Loan Balance",null,"Choose a Selection",{"$f":"IF(U17=\"Choose a Selection\",0,((IF(U17=\"$5,000,001-$7,500,000\",\"Call Lock Desk\",IF(U17=\"$7,500,001-$10,000,000\",\"Call Lock Desk\",INDEX(I$27:I$65,MATCH(U17,G$27:G$65,0)))))))","v":0},"No Ratio 0.75 - 0.99 (Review Matrix for LTV Qualification) ",null,null,null,"12 or 24 CPA P&L"]
[6.75,99.75,99.75,100.25,null,null,"640-659",null,-1.5,-1.75,-2.25,-2.75,-3.75,-4.5,{"$error":"#N/A"},{"$error":"#N/A"},{"$error":"#N/A"},null,"Purpose",null,"Choose a Selection",{"$f":"IF(AND(OR(U18='Feed(WS)'!J5:J9),U10=\"85.01-90\"),NA(),IF(ISERROR(IF(OR(U18=\"Purchase\",U18=\"Rate/Term Refi\"),0,INDEX(I$27:I$65,MATCH(U18,G$27:G$65,0)))),0,INDEX(I$27:I$65,MATCH(U18,G$27:G$65,0))))","v":0},null,null,null,null,"Asset Utlization W/ Bank Stmt"]
[6.875,100,100,100.5,null,null,"620-639",null,-2.25,-2.5,-3,-3.5,-4.75,-5.5,{"$error":"#N/A"},{"$error":"#N/A"},{"$error":"#N/A"},null,"Occupancy",null,"Choose a Selection",{"$f":"IF(OR('Feed(WS)'!A68:A74=TRUE),IF(U19=\"Choose a Selection\",0,(IF(OR(U19=\"Primary\"),0,IF(OR(U19=\"Non-Owner (Alt Doc/DSCR)\",U19=\"Full Doc - Non-Owner\"),0,INDEX(I$27:I$65,MATCH(U19,G$27:G$65,0)))))),NA())","v":{"$error":"#N/A"}}]
[6.9989999999999997,100.5,100.5,101,null,null,"600-619",null,-3,-3.25,-3.75,-4.25,-5.75,-6.5,{"$error":"#N/A"},{"$error":"#N/A"},{"$error":"#N/A"},null,"Property Type",null,"Choose a Selection",{"$f":"IF(AND(OR(U10='Feed(WS)'!B9:B11),OR(U20='Feed(WS)'!K8)),NA(),IF(U20=\"Choose a Selection\",0,(IF(OR(U20=\"SFR\",U20=\"1-2 Units\",U20=\"PUD\",U20=\"Condo\"),0,INDEX(I$27:I$65,MATCH(U20,G$27:G$65,0))))))","v":0}]
[7.125,100.75,100.75,101.25,null,null,"Foreign Nat' No Fico",null,{"$error":"#N/A"},{"$error":"#N/A"},{"$error":"#N/A"},{"$error":"#N/A"},{"$error":"#N/A"},{"$error":"#N/A"},{"$error":"#N/A"},{"$error":"#N/A"},{"$error":"#N/A"},null,"Loan Term",null,"30YR Fixed",{"$f":"IF(AND(U10='Feed(WS)'!B11,OR(U21='Feed(WS)'!M5:M6,U21='Feed(WS)'!M9,U21='Feed(WS)'!M12)),NA(),INDEX(Q26:Q36,MATCH(U21,O26:O36,0)))","v":0},null,null,null,null,"DSCR/No Ratio Column Includes"]
[7.25,101,101,101.5,null,null,null,null,null,null,null,null,null,null,null,null,null,null,"Escrow",null,"Escrow Not Waived",{"$f":"IF(U22=\"Escrow Not Waived\",0,INDEX(I$27:I$65,MATCH(U22,G$27:G$65,0)))","v":0},null,null,null,null,"DSCR"]
[7.375,101.25,101.25,101.75,null,null,null,null,null,null,null,null,null,null,null,null,null,null,"Prepayment Penalty",null,"Choose a Selection",{"$f":"IF(OR(U19=\"Primary\",U19=\"Second Home\"),0,INDEX(I$27:I$65,MATCH(U23,G$27:G$65,0)))","v":{"$error":"#N/A"}}]
[7.4989999999999997,101.5,101.5,102,null,null,null,null,null,null,null,null,null,null,null,null,null,null,"NJ - Title Vesting",null,null,0,null,null,null,null,"No Ratio"]
[7.625,101.75,101.75,102.25,null,null,"Loan Level Price Adjustments",null,null,null,"Grades",null,null,null,"Loan Term",null,null,null,"State",null,"All Other States",{"$f":"IF(U13='Feed(WS)'!D5,IFERROR(INDEX(I71:I75,MATCH(U25,G71:G75,0)),0),0)","v":0},"MINIMUM 3 YEAR PPP REQUIRED ON >80% LTVs"]
[7.75,102,102,102.5,null,null,null,null,"LLPA",null,"Select Standard",null,1,null,"15YR Fixed",null,0.25,null,"Lock Term",null,"30 Day",{"$f":"INDEX(M37:M40,MATCH(U26,K37:K40,0))","v":0}]
[7.875,102.25,102.25,102.75,null,null,"DTI >45% - All Doc Types",null,0,null,"A+",null,0.25,null,"30YR Fixed",null,0,null,"Buydown",null,"No",{"$f":"IF(OR(AND(OR(U27='Feed(WS)'!R4:R5),U18<>'Feed(WS)'!J3),AND(OR(U27='Feed(WS)'!R4:R5),U21<>'Feed(WS)'!M4)),NA(),0)","v":0}]
[7.9989999999999997,102.75,102.75,103.25,null,null,"DTI ≥50% - All Doc Types",null,-0.5,null,"A",null,-1.25,null,"30YR IO Fixed",null,-0.5,null,"Subordinate Financing",null,"No",{"$f":"IF(U28=\"Yes\",INDEX(I$27:I$65,MATCH(S28,G$27:G$65,0)),0)","v":0}]
[8.125,103,103,103.5,null,null,"ITIN",null,-1.5,null,"B",null,-1.75,null,"40YR Fixed",null,-0.5,null,{"$f":"IF(U29=\"Not Applicable\",\"\",IF('Feed(WS)'!X1=\"Yes\",'Feed(WS)'!V1,'Feed(WS)'!V2))","v":""},null,{"$f":"IF(OR('Feed(WS)'!X1=\"Yes\",'Feed(WS)'!X2=\"Yes\"),\"Yes\",\"Not Applicable\")","v":"Not Applicable"},{"$f":"IF(U29=\"Not Applicable\",0,IF(U29='Feed(WS)'!V4,VLOOKUP(S29,G$27:I$66,3,FALSE),0))","v":0}]
[8.25,103.25,103.25,103.75,null,null,"VOE Only",null,-0.25,null,"C",null,-2.25,null,"40YR IO Fixed",null,-0.75,null,{"$f":"IF('Feed(WS)'!Z3=0,\"\",INDEX('Feed(WS)'!$AA$1:$AA$3,MATCH('Feed(WS)'!Z3,'Feed(WS)'!$Z$1:$Z$3,0)))","v":""},null,{"$f":"IF(V30=0,'Feed(WS)'!Y4,'Feed(WS)'!Y5)","v":"Not Applicable"},{"$f":"'Feed(WS)'!Z3","v":0},0,null,null,null,"*** Extension Cost"]
{"$rows_left_out":46}
{"sheet":"Cover Page","index":2,"n_rows":45,"n_cols":18,"rows_kept":45,"cut":false,"hidden":true,"merged":[[44,1,44,21],[43,1,43,21],[36,2,36,3],[38,2,38,3],[36,5,36,6],[38,5,38,6],[36,8,36,9],[38,8,38,9],[38,17,38,19],[29,13,38,15],[29,2,29,3],[29,4,29,5],[30,6,30,8],[29,6,29,8],[30,2,30,3],[34,17,34,19],[13,13,13,20],[13,2,13,4],[14,3,14,4],[15,2,15,4],[16,2,16,4],[15,5,15,6],[16,5,16,6],[21,2,21,3],[21,4,21,5],[22,2,22,3],[22,4,22,5],[23,2,23,3],[23,4,23,5],[28,2,28,3],[28,4,28,5],[25,2,25,3],[27,2,27,3],[26,2,26,3],[26,4,26,5],[23,13,24,15],[11,1,11,21],[15,17,15,19],[24,17,24,19],[13,8,13,10],[14,8,16,10],[19,13,20,15],[17,13,18,15],[13,5,13,6],[18,17,18,20],[14,5,14,6],[20,17,20,19],[14,13,16,15],[19,2,19,9],[21,13,22,15],[24,2,24,3],[20,6,20,8],[20,2,20,3],[20,4,20,5],[36,17,36,19],[25,13,26,15],[27,13,28,15],[32,17,32,19],[30,17,30,19],[28,17,28,19],[26,17,26,19],[30,4,30,5],[21,6,21,8],[22,6,22,8],[23,6,23,8],[24,6,24,8],[28,6,28,8],[24,4,24,5],[26,6,26,8],[27,6,27,8],[25,4,25,5],[27,4,27,5],[25,6,25,8]]}
[]
[]
[]
[]
[null,null,null,null,null,null,null,null,null,"19000 MacArthur Boulevard, 2nd Floor"]
[null,null,null,null,null,null,null,null,null,"Irvine, CA 92612"]
[]
[]
[]
[]
[]
[null,"LoanStream Mortgage Wholesale NANQ Rate Sheet"]
[]
[null,null,"Underwriting Fee",null,null,"Relock Fee",null,null,"Mortgagee Clause",null,null,null,null,"Contact list"]
[null,null,"NANQ",1295,null,-0.25,null,null,"OCMBC, INC. ISAOA \n19000 MacArthur Blvd, Ste. 200 Irvine, CA 92612",null,null,null,null,"Corporate \nHeadquarters:",null,null,"Phone:","800-760-1833"]
[null,null,"DOC Fee - All Loans",null,null,"Extension Fee",null,null,null,null,null,null,null,null,null,null,"Email:","Inquires@LSMortgage.com"]
[null,null,79,null,null,"0.02/Day"]
[null,null,null,null,null,null,null,null,null,null,null,null,null,"NAN-Q\n Prequals",null,null,"Phone:","Email Only"]
[null,null,null,null,null,null,null,null,null,null,null,null,null,null,null,null,"Email:","EZQual@LSMortgage.com"]
[null,null,"Current Turn Times",null,null,null,null,null,null,null,null,null,null,"U/W Loan \nScenarios NAN-Q",null,null,"Phone:","Email Only"]
[null,null,"Stage",null,"Turn Times",null,"Department Hours",null,null,"Cutoff Time",null,null,null,null,null,null,"Email:","NANQScenario@LSMortgage.com"]
[null,null,"PreQual",null,"24-48 Hours",null,"PreQual Desk Hours: 8:00 AM-5:00 PM PST",null,null,"3:00 PM PST",null,null,null,"Submission Desk",null,null,"Phone:","Email Only"]
[null,null,"Set-up",null,"24-48 Hours",null,"Setup Desk Hours: 8:00 AM-6:00 PM PST",null,null,null,null,null,null,null,null,null,"Email:","Submissions_LS@LSMortgage.com"]
[null,null,"New Underwrite",null,"24-48 Hours",null,"Underwriting Hours: 7:00 AM-6:00 PM PST",null,null,"3:00 PM PST",null,null,null,"Lock Desk:",null,null,"Phone:","949-679-7059"]
[null,null,"Conditions Review",null,"24-48 Hours",null,"Underwriting Hours: 7:00 AM-6:00 PM PST",null,null,"3:00 PM PST",null,null,null,null,null,null,"Email:","LockDesk@LSMortgage.com"]
[null,null,"Part \"A\" QC",null,"48-72 Hours",null,"PreQual Desk Hours: 8:00 AM-5:00 PM PST",null,null,"3:30 PM PST",null,null,null,"CD Desk:",null,null,"Phone:","Email Only"]
[null,null,"Lock Desk",null,"SameDay",null,"Lock Desk Hours are: 8:30 AM - 5:00 PM PST",null,null,"5:00 PM PST",null,null,null,null,null,null,"Email:","CD@LSMortgage.com"]
[null,null,"CTC Review",null,"SameDay",null,"Underwriting Hours: 7:00 AM-6:00 PM PST",null,null,"1:00 PM PST",null,null,null,"Funding Department:",null,null,"Phone:","Email Only"]
[null,null,"CD",null,"SameDay",null,"CD Desk Hours: 7:30 AM-6:00 PM PST",null,null,"12:00 PM PST",null,null,null,null,null,null,"Email:","Funding@LSMortgage.com"]
[null,null,"DOCS",null,"SameDay",null,"DOCS Desk Hours: 7:30 AM-6:00 PM PST",null,null,"12:00 PM PST",null,null,null,"Management \nEscalations",null,null,"Name:","David Racer / Operations"]
{"$rows_left_out":16}
{"sheet":"Sheet1","index":3,"n_rows":0,"n_cols":0,"rows_kept":0,"cut":false,"hidden":true,"merged":[]}